BDBM534564 3-(2-amino-[1,2,4]triazolo[1,5-α]pyridin-7-yl)-N-((2R,3S)-3-(4-chlorophenyl)-2-fluoro-3-hydroxypropyl)-2-fluoro-6-methylbenzamide::WO2022086828, Example 300
SMILES Cc1ccc(c(F)c1C(=O)NC[C@@H](F)[C@@H](O)c1ccc(Cl)cc1)-c1ccn2nc(N)nc2c1
InChI Key InChIKey=GPXNCTKGLKXRLY-UTKZUKDTSA-N
Data  2 IC50
  Tab Delimited (TSV)   2D SDfile   Computed 3D by Vconf -m prep SDfile
Find this compound or compounds like it in BindingDB:
Activity Spreadsheet -- Enzyme Inhibition Constant Data from BindingDB
Found 2 hits for monomerid = 534564
TargetReceptor-interacting serine/threonine-protein kinase 1(Homo sapiens (Human))
Bristol-Myers Squibb
WIPO
LigandPNGBDBM534564(3-(2-amino-[1,2,4]triazolo[1,5-α]pyridin-7-yl...)
Affinity DataIC50:  0.600nM. Assay description: A solution was prepared containing 0.2 nM Anti GST-Tb (Cisbio, 61GSTTLB), 90.6 nM probe and 1 nM His-GST-TVMV-hRIPKl (1-324) in FRET Buffer (20 mM HE...
Ligand InfoPC cidPC sid
In DepthDetails PubMed
TargetMixed lineage kinase domain-like protein(Homo sapiens)
Bristol-Myers Squibb
WIPO
LigandPNGBDBM534564(3-(2-amino-[1,2,4]triazolo[1,5-α]pyridin-7-yl...)
Affinity DataIC50:  9.70nM. Assay description: HT29-L23 human colorectal adenocarcinoma cells were maintained in RPMI 1640 medium containing 10% heat-inactivated FBS, 1% Penicillin-Streptomycin an...
Ligand InfoPC cidPC sid
In DepthDetails PubMed