BDBM53838 MLS000705209::N'-(5-bromo-2-hydroxybenzylidene)-2-chlorobenzohydrazide::N'-[(E)-(3-bromanyl-6-oxidanylidene-cyclohexa-2,4-dien-1-ylidene)methyl]-2-chloranyl-benzohydrazide::N'-[(E)-(3-bromo-6-keto-cyclohexa-2,4-dien-1-ylidene)methyl]-2-chloro-benzohydrazide::N'-[(E)-(3-bromo-6-oxo-1-cyclohexa-2,4-dienylidene)methyl]-2-chlorobenzohydrazide::N'-[(E)-(3-bromo-6-oxocyclohexa-2,4-dien-1-ylidene)methyl]-2-chlorobenzohydrazide::SMR000230762::cid_5436804
SMILES Oc1ccc(Br)cc1C=NNC(=O)c1ccccc1Cl
InChI Key InChIKey=ZBQGQODXTZYKLE-UHFFFAOYSA-N
Data  1 IC50  1 EC50
  Tab Delimited (TSV)   2D SDfile   Computed 3D by Vconf -m prep SDfile
Find this compound or compounds like it in BindingDB:
Activity Spreadsheet -- Enzyme Inhibition Constant Data from BindingDB
Found 2 hits for monomerid = 53838
TargetGlycogen synthase kinase-3 beta(Homo sapiens (Human))
Broad Institute
Curated by PubChem BioAssay
LigandPNGBDBM53838(MLS000705209 | N'-(5-bromo-2-hydroxybenzyliden...)
Affinity DataEC50: >3.00E+5nM. Assay description: Keywords: GSK3beta, dose response, kinase, inhibition, HTS Assay Overview: The glycogen synthase kinase-3 beta (GSK-3b) is a known master regulator f...
In DepthDetails PCBioAssay
TargetM1 family aminopeptidase(Plasmodium falciparum (isolate FcB1 / Columbia))
Srmlsc
Curated by PubChem BioAssay
LigandPNGBDBM53838(MLS000705209 | N'-(5-bromo-2-hydroxybenzyliden...)
Affinity DataIC50:  8.06E+3nM. Assay description: Southern Research Molecular Libraries Screening Center (SRMLSC) Southern Research Institute (Birmingham, Alabama) NIH Molecular Libraries Screening...
In DepthDetails PCBioAssay