BDBM548071 WO2022091056, Example 62
SMILES Cc1c(c(Cl)cc[n+]1[O-])-c1ccc(NC(=O)[C@@H](NC(=O)c2ccnn2C)C2CCCCC2)c(F)c1F
InChI Key InChIKey=HHHAXWDGVZFODH-QHCPKHFHSA-N
Data  1 IC50
  Tab Delimited (TSV)   2D SDfile   Computed 3D by Vconf -m prep SDfile
Find this compound or compounds like it in BindingDB:
Activity Spreadsheet -- Enzyme Inhibition Constant Data from BindingDB
Found 1 hit for monomerid = 548071
TargetInterleukin-17 receptor A/(Homo sapiens (Human))
Novartis
WIPO
LigandPNGBDBM548071(WO2022091056, Example 62)
Affinity DataIC50:  15nM. Assay description:  Dilutions of test compounds in DMSO are plated onto white low-volume 384-well plates (Greiner, #784075). Specifically, solutions of graded concentra...
Ligand InfoPC cidPC sid
In DepthDetails PubMed