BDBM548350 WO2022093856, Example 1-45
SMILES CC(C)C[C@@H](Cn1cncn1)Nc1nc(nc2CC(C)(C)CCc12)N1CCC2(CN(C2)C(=O)C=C)C1
InChI Key InChIKey=VYTOHANJGJHSOR-FQEVSTJZSA-N
Data  1 IC50
  Tab Delimited (TSV)   2D SDfile   Computed 3D by Vconf -m prep SDfile
Find this compound or compounds like it in BindingDB:
Activity Spreadsheet -- Enzyme Inhibition Constant Data from BindingDB
Found 1 hit for monomerid = 548350
TargetGTPase KRas [1-169,G12C,C118A](Homo sapiens (Human))
Amgen
WIPO
LigandPNGBDBM548350(WO2022093856, Example 1-45)
Affinity DataIC50:  1.51E+3nM
Ligand InfoPC cidPC sid
In DepthDetails PubMed