BDBM548542 WO2022093881, Ex-10.51
SMILES CC[C@@H]1[C@@H]([C@H]1c1ccn(C)n1)C(=O)Nc1cc2cc(N3CCN(CC3)[C@]3(C)COC[C@@H]3F)c(Cl)cc2cn1
InChI Key InChIKey=XNSZUPYKHARFOP-ROSTYKGWSA-N
Data  1 IC50
  Tab Delimited (TSV)   2D SDfile   Computed 3D by Vconf -m prep SDfile
Find this compound or compounds like it in BindingDB:
Activity Spreadsheet -- Enzyme Inhibition Constant Data from BindingDB
Found 1 hit for monomerid = 548542
TargetLeucine-rich repeat serine/threonine-protein kinase 2 [G2019S](Homo sapiens (Human))
Merck Sharp &Amp
WIPO
LigandPNGBDBM548542(WO2022093881, Ex-10.51)
Affinity DataIC50:  0.0800nM. Assay description:  The LRRK2 kinase activity reported herein as IC50 values was determined with LanthaScreen™ technology from Life Technologies Corporation (Carlsbad, ...
Ligand InfoPC cidPC sid
In DepthDetails PubMed