BDBM548588 WO2022093881, Ex-11.1
SMILES C[C@]1(C[C@H]1C(=O)Nc1cc2cc(N3CCN(CC3)[C@@]3(C)COC[C@H]3O)c(Cl)cc2cn1)c1ccccn1
InChI Key InChIKey=DQMNHFUGMCVGQT-GLBBNVBASA-N
Data  1 IC50
  Tab Delimited (TSV)   2D SDfile   Computed 3D by Vconf -m prep SDfile
Find this compound or compounds like it in BindingDB:
Activity Spreadsheet -- Enzyme Inhibition Constant Data from BindingDB
Found 1 hit for monomerid = 548588
TargetLeucine-rich repeat serine/threonine-protein kinase 2 [G2019S](Homo sapiens (Human))
Merck Sharp &Amp
WIPO
LigandPNGBDBM548588(WO2022093881, Ex-11.1)
Affinity DataIC50:  0.0800nM. Assay description:  The LRRK2 kinase activity reported herein as IC50 values was determined with LanthaScreen™ technology from Life Technologies Corporation (Carlsbad, ...
Ligand InfoPC cidPC sid
In DepthDetails PubMed