BDBM548722 WO2022098806, Compound 1-118
SMILES CNC(=O)[C@@H]1CCc2cc(Nc3ncc4cc(F)c(cc4n3)-c3cnc4OCCNc4c3C)ccc12
InChI Key InChIKey=CUVYXFYJIOVKME-LJQANCHMSA-N
Data  1 IC50
  Tab Delimited (TSV)   2D SDfile   Computed 3D by Vconf -m prep SDfile
Find this compound or compounds like it in BindingDB:
Activity Spreadsheet -- Enzyme Inhibition Constant Data from BindingDB
Found 1 hit for monomerid = 548722
TargetMitogen-activated protein kinase kinase kinase kinase 1(Homo sapiens (Human))
Merck Sharp &Amp
WIPO
LigandPNGBDBM548722(WO2022098806, Compound 1-118)
Affinity DataIC50:  0.0400nM. Assay description:  To each well of black Corning #3820384-well plate, an ECHO was used to dispense 7.5 nL of DMSO or Test compound in DMSO. A 1.5x kinase solution, 5 &...
Ligand InfoPC cidPC sid
In DepthDetails PubMed