BDBM548835 WO2022098806, Compound 2-102::WO2022098806, Compound 2-112::WO2022098806, Compound 2-113::WO2022098806, Compound 2-96
SMILES CC(C)N1CCc2ccc(Nc3ncc4c(N)c(F)c(c(Cl)c4n3)-c3cnc4OCCNc4c3C)cc2C1
InChI Key InChIKey=OUDIDRNWWDBMQR-UHFFFAOYSA-N
Data  4 IC50
  Tab Delimited (TSV)   2D SDfile   Computed 3D by Vconf -m prep SDfile
Find this compound or compounds like it in BindingDB:
Activity Spreadsheet -- Enzyme Inhibition Constant Data from BindingDB
Found 4 hits for monomerid = 548835
TargetMitogen-activated protein kinase kinase kinase kinase 1(Homo sapiens (Human))
Merck Sharp &Amp
WIPO
LigandPNGBDBM548835(WO2022098806, Compound 2-102 | WO2022098806, Compo...)
Affinity DataIC50:  0.0800nM. Assay description:  To each well of black Corning #3820384-well plate, an ECHO was used to dispense 7.5 nL of DMSO or Test compound in DMSO. A 1.5x kinase solution, 5 &...
Ligand InfoPC cidPC sid
In DepthDetails PubMed
TargetMitogen-activated protein kinase kinase kinase kinase 1(Homo sapiens (Human))
Merck Sharp &Amp
WIPO
LigandPNGBDBM548835(WO2022098806, Compound 2-102 | WO2022098806, Compo...)
Affinity DataIC50:  0.0400nM. Assay description:  To each well of black Corning #3820384-well plate, an ECHO was used to dispense 7.5 nL of DMSO or Test compound in DMSO. A 1.5x kinase solution, 5 &...
Ligand InfoPC cidPC sid
In DepthDetails PubMed
TargetMitogen-activated protein kinase kinase kinase kinase 1(Homo sapiens (Human))
Merck Sharp &Amp
WIPO
LigandPNGBDBM548835(WO2022098806, Compound 2-102 | WO2022098806, Compo...)
Affinity DataIC50:  0.820nM. Assay description:  To each well of black Corning #3820384-well plate, an ECHO was used to dispense 7.5 nL of DMSO or Test compound in DMSO. A 1.5x kinase solution, 5 &...
Ligand InfoPC cidPC sid
In DepthDetails PubMed
TargetMitogen-activated protein kinase kinase kinase kinase 1(Homo sapiens (Human))
Merck Sharp &Amp
WIPO
LigandPNGBDBM548835(WO2022098806, Compound 2-102 | WO2022098806, Compo...)
Affinity DataIC50:  0.200nM. Assay description:  To each well of black Corning #3820384-well plate, an ECHO was used to dispense 7.5 nL of DMSO or Test compound in DMSO. A 1.5x kinase solution, 5 &...
Ligand InfoPC cidPC sid
In DepthDetails PubMed