BDBM55034 MLS000391053::N-[3-cyano-4,5-bis(2-furanyl)-2-furanyl]-2-phenoxypropanamide::N-[3-cyano-4,5-bis(2-furyl)-2-furyl]-2-phenoxy-propionamide::N-[3-cyano-4,5-bis(furan-2-yl)furan-2-yl]-2-phenoxy-propanamide::N-[3-cyano-4,5-bis(furan-2-yl)furan-2-yl]-2-phenoxypropanamide::SMR000260090::cid_4033224
SMILES CC(Oc1ccccc1)C(=O)Nc1oc(-c2ccco2)c(-c2ccco2)c1C#N
InChI Key InChIKey=LJQUHLGVZYCMOX-UHFFFAOYSA-N
Data  1 IC50
  Tab Delimited (TSV)   2D SDfile   Computed 3D by Vconf -m prep SDfile
Find this compound or compounds like it in BindingDB:
Activity Spreadsheet -- Enzyme Inhibition Constant Data from BindingDB
Found 1 hit for monomerid = 55034
TargetGenome polyprotein(Hepatitis C virus)
The Scripps Research Institute Molecular Screening Center
Curated by PubChem BioAssay
LigandPNGBDBM55034(MLS000391053 | N-[3-cyano-4,5-bis(2-furanyl)-2-fur...)
Affinity DataIC50:  1.67E+4nM. Assay description: Source (MLPCN Center Name): The Scripps Research Institute Molecular Screening Center (SRIMSC) Center Affiliation: The Scripps Research Institute (TS...
Ligand InfoPC cidPC sid
In DepthDetails PCBioAssay