BDBM55035 (6E)-4-benzyl-6-[(4-morpholin-4-ylanilino)methylidene]-2-nitrocyclohexa-2,4-dien-1-one::(6E)-4-benzyl-6-[(4-morpholinoanilino)methylene]-2-nitro-cyclohexa-2,4-dien-1-one::(6E)-6-[[(4-morpholin-4-ylphenyl)amino]methylidene]-2-nitro-4-(phenylmethyl)cyclohexa-2,4-dien-1-one::(6E)-6-[[4-(4-morpholinyl)anilino]methylidene]-2-nitro-4-(phenylmethyl)-1-cyclohexa-2,4-dienone::4-benzyl-2-nitro-6-({[4-(4-morpholinyl)phenyl]imino}methyl)phenol::MLS000698959::SMR000231104::cid_6350762
SMILES [O-][N+](=O)c1c[c-](Cc2ccccc2)cc(\C=[NH+]\c2ccc(cc2)N2CCOCC2)c1=O
InChI Key InChIKey=CWXYXPGSOONMFX-KOEQRZSOSA-O
Data  3 IC50
  Tab Delimited (TSV)   2D SDfile   Computed 3D by Vconf -m prep SDfile
Find this compound or compounds like it in BindingDB:
Activity Spreadsheet -- Enzyme Inhibition Constant Data from BindingDB
Found 3 hits for monomerid = 55035
TargetGenome polyprotein(Hepatitis C virus)
The Scripps Research Institute Molecular Screening Center
Curated by PubChem BioAssay
LigandPNGBDBM55035((6E)-4-benzyl-6-[(4-morpholin-4-ylanilino)methylid...)
Affinity DataIC50:  7.65E+3nM. Assay description: Source (MLPCN Center Name): The Scripps Research Institute Molecular Screening Center (SRIMSC) Center Affiliation: The Scripps Research Institute (TS...
Ligand InfoPC cidPC sid
In DepthDetails PCBioAssay
TargetC-C chemokine receptor type 6(Homo sapiens (Human))
Burnham Center For Chemical Genomics
Curated by PubChem BioAssay
LigandPNGBDBM55035((6E)-4-benzyl-6-[(4-morpholin-4-ylanilino)methylid...)
Affinity DataIC50: >6.66E+4nM. Assay description: Data Source: Sanford-Burnham Center for Chemical Genomics (SBCCG) Source Affiliation: Sanford-Burnham Medical Research Institute(SBMRI, San Diego, CA...
Ligand InfoPC cidPC sid
In DepthDetails PCBioAssay
TargetBeta-galactosidase(Escherichia coli)
Burnham Center For Chemical Genomics
Curated by PubChem BioAssay
LigandPNGBDBM55035((6E)-4-benzyl-6-[(4-morpholin-4-ylanilino)methylid...)
Affinity DataIC50: >6.66E+4nM. Assay description: Data Source: Sanford-Burnham Center for Chemical Genomics (SBCCG) Source Affiliation: Sanford-Burnham Medical Research Institute(SBMRI, San Diego, C...
Ligand InfoPC cidPC sid
In DepthDetails PCBioAssay