BDBM56092 2-(4-azanylidenequinolin-1-yl)-N,N-dipropyl-ethanamide;hydrochloride::2-(4-imino-1-quinolinyl)-N,N-dipropylacetamide;hydrochloride::2-(4-imino-1-quinolyl)-N,N-dipropyl-acetamide;hydrochloride::2-(4-iminoquinolin-1(4H)-yl)-N,N-dipropylacetamide::2-(4-iminoquinolin-1-yl)-N,N-dipropylacetamide;hydrochloride::MLS000047676::SMR000033686::cid_6602912
SMILES CCCN(CCC)C(=O)Cn1ccc(=N)c2ccccc12
InChI Key InChIKey=JHKIWVWSZYSIJO-UHFFFAOYSA-N
Data  1 IC50
  Tab Delimited (TSV)   2D SDfile   Computed 3D by Vconf -m prep SDfile
Find this compound or compounds like it in BindingDB:
Activity Spreadsheet -- Enzyme Inhibition Constant Data from BindingDB
Found 1 hit for monomerid = 56092
TargetKallikrein-5(Homo sapiens (Human))
Pcmd
Curated by PubChem BioAssay
LigandPNGBDBM56092(2-(4-azanylidenequinolin-1-yl)-N,N-dipropyl-ethana...)
Affinity DataIC50:  5.00E+4nM. Assay description: Molecular Library Screening Center Network (MLSCN) Penn Center for Molecular Discovery (PCMD) Assay Provider: Scott L. Diamond, University of Pennsy...
In DepthDetails PCBioAssay