BDBM56493 MLS000537575::N-[2-(4-propoxyphenoxy)ethyl]cyclopentanamine::N-cyclopentyl-N-[2-(4-propoxyphenoxy)ethyl]amine::SMR000164018::cid_1825672::cyclopentyl-[2-(4-propoxyphenoxy)ethyl]amine
SMILES CCCOc1ccc(OCCNC2CCCC2)cc1
InChI Key InChIKey=DMYZPOWDKWCBMC-UHFFFAOYSA-N
Data  1 IC50
  Tab Delimited (TSV)   2D SDfile   Computed 3D by Vconf -m prep SDfile
Find this compound or compounds like it in BindingDB:
Activity Spreadsheet -- Enzyme Inhibition Constant Data from BindingDB
Found 1 hit for monomerid = 56493
TargetKallikrein-5(Homo sapiens (Human))
Pcmd
Curated by PubChem BioAssay
LigandPNGBDBM56493(MLS000537575 | N-[2-(4-propoxyphenoxy)ethyl]cyclop...)
Affinity DataIC50:  5.00E+4nM. Assay description: Molecular Library Screening Center Network (MLSCN) Penn Center for Molecular Discovery (PCMD) Assay Provider: Scott L. Diamond, University of Pennsy...
In DepthDetails PCBioAssay