BDBM58066 4-[3-(2,4-Dihydroxy-phenyl)-1H-pyrazol-4-yloxy]-benzoic acid propyl ester::4-[[(3E)-3-(2-hydroxy-4-keto-cyclohexa-2,5-dien-1-ylidene)-3-pyrazolin-4-yl]oxy]benzoic acid propyl ester::4-[[(3E)-3-(2-hydroxy-4-oxo-1-cyclohexa-2,5-dienylidene)-1,2-dihydropyrazol-4-yl]oxy]benzoic acid propyl ester::MLS000778941::SMR000415641::cid_16682263::propyl 4-[[(3E)-3-(2-hydroxy-4-oxocyclohexa-2,5-dien-1-ylidene)-1,2-dihydropyrazol-4-yl]oxy]benzoate::propyl 4-[[(3E)-3-(2-oxidanyl-4-oxidanylidene-cyclohexa-2,5-dien-1-ylidene)-1,2-dihydropyrazol-4-yl]oxy]benzoate
SMILES CCCOC(=O)c1ccc(Oc2c[nH]nc2-c2ccc(O)cc2O)cc1
InChI Key InChIKey=CRPJJPYSSBAAHW-UHFFFAOYSA-N
Data  2 EC50
  Tab Delimited (TSV)   2D SDfile   Computed 3D by Vconf -m prep SDfile
Find this compound or compounds like it in BindingDB:
Activity Spreadsheet -- Enzyme Inhibition Constant Data from BindingDB
Found 2 hits for monomerid = 58066
TargetHeat shock factor protein 1(Mus musculus)
Broad Institute
Curated by PubChem BioAssay
LigandPNGBDBM58066(4-[3-(2,4-Dihydroxy-phenyl)-1H-pyrazol-4-yloxy]-be...)
Affinity DataEC50: >2.60E+5nM. Assay description: Keywords: Heat Shock Factor-1 (HSF-1), Stress Response, MG132, NIH3T3, Luminescence Assay Overview: Confirmation testing of small molecules identifie...
In DepthDetails PCBioAssay
TargetStreptokinase A(Streptococcus pyogenes M1 GAS)
Broad Institute
Curated by PubChem BioAssay
LigandPNGBDBM58066(4-[3-(2,4-Dihydroxy-phenyl)-1H-pyrazol-4-yloxy]-be...)
Affinity DataEC50:  1.50E+5nM. Assay description: Keywords: Group A streptococcus, GAS, streptokinase, expression, virulence, inhibition, dose response, EC50 Assay Overview: The goal of this assa...
In DepthDetails PCBioAssay