BDBM5867 2-Anilino-5-aryloxazole 30::5-(4-Chlorophenyl)-N-[5-(ethylsulfonyl)-2-methoxyphenyl]-1,3-oxazol-2-amine::5-(4-chlorophenyl)-N-[5-(ethanesulfonyl)-2-methoxyphenyl]-1,3-oxazol-2-amine
SMILES CCS(=O)(=O)c1ccc(OC)c(Nc2ncc(o2)-c2ccc(Cl)cc2)c1
InChI Key InChIKey=ZAEZEADQIGFKLO-UHFFFAOYSA-N
Data  1 IC50
  Tab Delimited (TSV)   2D SDfile   Computed 3D by Vconf -m prep SDfile
Find this compound or compounds like it in BindingDB:
Activity Spreadsheet -- Enzyme Inhibition Constant Data from BindingDB
Found 1 hit for monomerid = 5867
TargetVascular endothelial growth factor receptor 2(Homo sapiens (Human))
Glaxosmithkline
LigandPNGBDBM5867(2-Anilino-5-aryloxazole 30 | 5-(4-Chlorophenyl)-N-...)
Affinity DataIC50:  81nM. Assay description: The assay was using baculovirus-expressed recombinant protein kinase purified as the intracellular domain fused by GST tag, interacting with biotinyl...
In DepthDetails ArticlePubMed