BDBM5880 2-Anilino-5-aryloxazole 44::N-[5-(Ethylsulfonyl)-2-methoxyphenyl]-5-(2 -fluoro-1,1 -biphenyl-3-yl)-1,3-oxazol-2-amine::N-[5-(ethanesulfonyl)-2-methoxyphenyl]-5-[3-(2-fluorophenyl)phenyl]-1,3-oxazol-2-amine
SMILES CCS(=O)(=O)c1ccc(OC)c(Nc2ncc(o2)-c2cccc(c2)-c2ccccc2F)c1
InChI Key InChIKey=DOKIBWCVABZHOH-UHFFFAOYSA-N
Data  1 IC50
  Tab Delimited (TSV)   2D SDfile   Computed 3D by Vconf -m prep SDfile
Find this compound or compounds like it in BindingDB:
Activity Spreadsheet -- Enzyme Inhibition Constant Data from BindingDB
Found 1 hit for monomerid = 5880
TargetVascular endothelial growth factor receptor 2(Homo sapiens (Human))
Glaxosmithkline
LigandPNGBDBM5880(2-Anilino-5-aryloxazole 44 | N-[5-(Ethylsulfonyl)-...)
Affinity DataIC50:  89nM. Assay description: The assay was using baculovirus-expressed recombinant protein kinase purified as the intracellular domain fused by GST tag, interacting with biotinyl...
In DepthDetails ArticlePubMed