BDBM58964 (4E)-4-[4-(3,4-dimethoxyphenyl)-5-methyl-1,2-dihydropyrazol-3-ylidene]-3-hydroxy-1-cyclohexa-2,5-dienone::(4E)-4-[4-(3,4-dimethoxyphenyl)-5-methyl-1,2-dihydropyrazol-3-ylidene]-3-hydroxycyclohexa-2,5-dien-1-one::(4E)-4-[4-(3,4-dimethoxyphenyl)-5-methyl-1,2-dihydropyrazol-3-ylidene]-3-oxidanyl-cyclohexa-2,5-dien-1-one::(4E)-4-[4-(3,4-dimethoxyphenyl)-5-methyl-3-pyrazolin-3-ylidene]-3-hydroxy-cyclohexa-2,5-dien-1-one::4-[4-(3,4-dimethoxyphenyl)-5-methyl-1H-pyrazol-3-yl]-1,3-benzenediol::MLS000531365::SMR000136343::cid_6620956
SMILES COc1ccc(cc1OC)-c1c(C)[nH]nc1-c1ccc(O)cc1O
InChI Key InChIKey=SADMOYKKNMBFNC-UHFFFAOYSA-N
Data  1 EC50
  Tab Delimited (TSV)   2D SDfile   Computed 3D by Vconf -m prep SDfile
Find this compound or compounds like it in BindingDB:
Activity Spreadsheet -- Enzyme Inhibition Constant Data from BindingDB
Found 1 hit for monomerid = 58964
TargetLarge T antigen(Simian virus 40)
Southern Research Specialized Biocontainment Screening Center
Curated by PubChem BioAssay
LigandPNGBDBM58964((4E)-4-[4-(3,4-dimethoxyphenyl)-5-methyl-1,2-dihyd...)
Affinity DataEC50: >5.00E+4nM. Assay description: Southern Research's Specialized Biocontainment Screening Center (SRSBSC) Southern Research Institute (Birmingham, Alabama) NIH Molecular Librarie...
In DepthDetails PCBioAssay