BDBM58971 4-({2-[2-(dimethylamino)propyl]phenyl}sulfanyl)phenol::4-[2-[2-(dimethylamino)propyl]phenyl]sulfanylphenol;ethanol;hydrochloride::4-[[2-[2-(dimethylamino)propyl]phenyl]thio]phenol;ethanol;hydrochloride::MLS000540150::SMR000161825::cid_11948753
SMILES CC(Cc1ccccc1Sc1ccc(O)cc1)N(C)C
InChI Key InChIKey=XIALVPWRLIIBKE-UHFFFAOYSA-N
Data  1 EC50
  Tab Delimited (TSV)   2D SDfile   Computed 3D by Vconf -m prep SDfile
Find this compound or compounds like it in BindingDB:
Activity Spreadsheet -- Enzyme Inhibition Constant Data from BindingDB
Found 1 hit for monomerid = 58971
TargetLarge T antigen(Simian virus 40)
Southern Research Specialized Biocontainment Screening Center
Curated by PubChem BioAssay
LigandPNGBDBM58971(4-({2-[2-(dimethylamino)propyl]phenyl}sulfanyl)phe...)
Affinity DataEC50: >5.00E+4nM. Assay description: Southern Research's Specialized Biocontainment Screening Center (SRSBSC) Southern Research Institute (Birmingham, Alabama) NIH Molecular Librarie...
In DepthDetails PCBioAssay