BDBM59816 MLS000538280::N-[2-[4-ethyl-5-[[2-keto-2-(p-phenetidino)ethyl]thio]-1,2,4-triazol-3-yl]ethyl]-4-methoxy-benzamide::N-[2-[5-[2-(4-ethoxyanilino)-2-oxoethyl]sulfanyl-4-ethyl-1,2,4-triazol-3-yl]ethyl]-4-methoxybenzamide::N-[2-[5-[2-[(4-ethoxyphenyl)amino]-2-oxidanylidene-ethyl]sulfanyl-4-ethyl-1,2,4-triazol-3-yl]ethyl]-4-methoxy-benzamide::N-[2-[5-[[2-(4-ethoxyanilino)-2-oxoethyl]thio]-4-ethyl-1,2,4-triazol-3-yl]ethyl]-4-methoxybenzamide::N-{2-[5-({2-[(4-ethoxyphenyl)amino]-2-oxoethyl}thio)-4-ethyl-4H-1,2,4-triazol-3-yl]ethyl}-4-methoxybenzamide::SMR000144320::cid_2964970
SMILES CCOc1ccc(NC(=O)CSc2nnc(CCNC(=O)c3ccc(OC)cc3)n2CC)cc1
InChI Key InChIKey=XVXZRLSGHRCRKQ-UHFFFAOYSA-N
Data  1 IC50
  Tab Delimited (TSV)   2D SDfile   Computed 3D by Vconf -m prep SDfile
Find this compound or compounds like it in BindingDB:
Activity Spreadsheet -- Enzyme Inhibition Constant Data from BindingDB
Found 1 hit for monomerid = 59816
TargetM17 leucyl aminopeptidase(Plasmodium falciparum 3D7)
Srmlsc
Curated by PubChem BioAssay
LigandPNGBDBM59816(MLS000538280 | N-[2-[4-ethyl-5-[[2-keto-2-(p-phene...)
Affinity DataIC50:  8.71E+3nM. Assay description: Southern Research Molecular Libraries Screening Center (SRMLSC) Southern Research Institute (Birmingham, Alabama) NIH Molecular Libraries Screening...
In DepthDetails PCBioAssay