BDBM61265 1-ethyl-3-(2-hydroxyethyl)-2-methyl-5-benzimidazol-1-iumcarboxylic acid ethyl ester;iodide::1-ethyl-3-(2-hydroxyethyl)-2-methyl-benzimidazol-1-ium-5-carboxylic acid ethyl ester;iodide::6-Ethoxycarbonyl-3-ethyl-1-(2-hydroxy-ethyl)-2-methyl-3H-benzoimidazol-1-ium::MLS000029721::SMR000000974::cid_654505::ethyl 1-ethyl-3-(2-hydroxyethyl)-2-methyl-benzimidazol-1-ium-5-carboxylate;iodide::ethyl 1-ethyl-3-(2-hydroxyethyl)-2-methylbenzimidazol-1-ium-5-carboxylate;iodide
SMILES CCOC(=O)c1ccc2[n+](CC)c(C)n(CCO)c2c1
InChI Key InChIKey=XFPRFLNSKPNNLS-UHFFFAOYSA-N
Data  2 IC50
  Tab Delimited (TSV)   2D SDfile   Computed 3D by Vconf -m prep SDfile
Find this compound or compounds like it in BindingDB:
Activity Spreadsheet -- Enzyme Inhibition Constant Data from BindingDB
Found 2 hits for monomerid = 61265
TargetEukaryotic translation initiation factor 4H(Homo sapiens (Human))
Burnham Center For Chemical Genomics
Curated by PubChem BioAssay
LigandPNGBDBM61265(1-ethyl-3-(2-hydroxyethyl)-2-methyl-5-benzimidazol...)
Affinity DataIC50:  1.00E+5nM. Assay description: Data Source: Sanford-Burnham Center for Chemical Genomics (SBCCG) Source Affiliation: Sanford-Burnham Medical Research Institute (SBMRI, San Diego, C...
Ligand InfoPC cidPC sid
In DepthDetails PCBioAssay
TargetPolyadenylate-binding protein 1(Homo sapiens (Human))
Burnham Center For Chemical Genomics
Curated by PubChem BioAssay
LigandPNGBDBM61265(1-ethyl-3-(2-hydroxyethyl)-2-methyl-5-benzimidazol...)
Affinity DataIC50:  3.29E+3nM. Assay description: Data Source: Sanford-Burnham Center for Chemical Genomics (SBCCG) Source Affiliation: Sanford-Burnham Medical Research Institute (SBMRI, San Diego, C...
Ligand InfoPC cidPC sid
In DepthDetails PCBioAssay