BDBM61510 4,5-dimethyl-2-[[6-methyl-4-(p-tolyl)-2-thioxo-3,4-dihydro-1H-pyrimidine-5-carbonyl]amino]thiophene-3-carboxylic acid ethyl ester::4,5-dimethyl-2-[[[6-methyl-4-(4-methylphenyl)-2-sulfanylidene-3,4-dihydro-1H-pyrimidin-5-yl]-oxomethyl]amino]-3-thiophenecarboxylic acid ethyl ester::MLS000335469::SMR000250227::cid_3304875::ethyl 4,5-dimethyl-2-[[6-methyl-4-(4-methylphenyl)-2-sulfanylidene-3,4-dihydro-1H-pyrimidin-5-yl]carbonylamino]thiophene-3-carboxylate::ethyl 4,5-dimethyl-2-[[6-methyl-4-(4-methylphenyl)-2-sulfanylidene-3,4-dihydro-1H-pyrimidine-5-carbonyl]amino]thiophene-3-carboxylate
SMILES CCOC(=O)c1c(C)c(C)sc1NC(=O)C1C(NC(=S)N=C1C)c1ccc(C)cc1
InChI Key InChIKey=BIDAPMPIGQDACM-UHFFFAOYSA-N
Data  1 IC50
  Tab Delimited (TSV)   2D SDfile   Computed 3D by Vconf -m prep SDfile
Find this compound or compounds like it in BindingDB:
Activity Spreadsheet -- Enzyme Inhibition Constant Data from BindingDB
Found 1 hit for monomerid = 61510
TargetG-protein coupled receptor 55(Homo sapiens (Human))
Burnham Center For Chemical Genomics
Curated by PubChem BioAssay
LigandPNGBDBM61510(4,5-dimethyl-2-[[6-methyl-4-(p-tolyl)-2-thioxo-3,4...)
Affinity DataIC50:  500nM. Assay description: Data Source: Sanford-Burnham Center for Chemical Genomics (SBCCG) Source Affiliation: Sanford-Burnham Medical Research Institute (SBMRI, San Diego, C...
In DepthDetails PCBioAssay