BDBM62829 2-furanyl-[4-[(6-hydroxy-2-methyl-5-thiazolo[3,2-b][1,2,4]triazolyl)-(3-methoxyphenyl)methyl]-1-piperazinyl]methanone::2-furyl-[4-[(6-hydroxy-2-methyl-thiazolo[3,2-b][1,2,4]triazol-5-yl)-(3-methoxyphenyl)methyl]piperazino]methanone::MLS000101787::SMR000017084::cid_4152247::furan-2-yl-[4-[(3-methoxyphenyl)-(2-methyl-6-oxidanyl-[1,3]thiazolo[3,2-b][1,2,4]triazol-5-yl)methyl]piperazin-1-yl]methanone::furan-2-yl-[4-[(6-hydroxy-2-methyl-[1,3]thiazolo[3,2-b][1,2,4]triazol-5-yl)-(3-methoxyphenyl)methyl]piperazin-1-yl]methanone
SMILES COc1cccc(c1)C(N1CCN(CC1)C(=O)c1ccco1)c1sc2nc(C)nn2c1O
InChI Key InChIKey=SZSHZEAYBDBMKG-UHFFFAOYSA-N
Data  1 EC50
  Tab Delimited (TSV)   2D SDfile   Computed 3D by Vconf -m prep SDfile
Find this compound or compounds like it in BindingDB:
Activity Spreadsheet -- Enzyme Inhibition Constant Data from BindingDB
Found 1 hit for monomerid = 62829
TargetHeat shock factor protein 1(Mus musculus)
Broad Institute
Curated by PubChem BioAssay
LigandPNGBDBM62829(2-furanyl-[4-[(6-hydroxy-2-methyl-5-thiazolo[3,2-b...)
Affinity DataEC50: >1.95E+5nM. Assay description: Keywords: Heat Shock Factor-1 (HSF-1), Stress Response, MG132, NIH3T3, Luminescence Assay Overview: Modified NIH3T3, transformed to express firefly...
In DepthDetails PCBioAssay