BDBM63324 3-[[5-(4-ethylphenyl)-6H-1,3,4-thiadiazin-2-yl]amino]-N,N-dimethyl-benzenesulfonamide::3-[[5-(4-ethylphenyl)-6H-1,3,4-thiadiazin-2-yl]amino]-N,N-dimethylbenzenesulfonamide::MLS000339491::SMR000244106::cid_5240041
SMILES CCc1ccc(cc1)C1=NN=C(Nc2cccc(c2)S(=O)(=O)N(C)C)SC1
InChI Key InChIKey=KHWOFOKQCKHWOQ-UHFFFAOYSA-N
Data  3 EC50
  Tab Delimited (TSV)   2D SDfile   Computed 3D by Vconf -m prep SDfile
Find this compound or compounds like it in BindingDB:
Activity Spreadsheet -- Enzyme Inhibition Constant Data from BindingDB
Found 3 hits for monomerid = 63324
TargetHeat shock factor protein 1(Mus musculus)
Broad Institute
Curated by PubChem BioAssay
LigandPNGBDBM63324(3-[[5-(4-ethylphenyl)-6H-1,3,4-thiadiazin-2-yl]ami...)
Affinity DataEC50: >1.95E+5nM. Assay description: Keywords: Heat Shock Factor-1 (HSF-1), Stress Response, MG132, NIH3T3, Luminescence Assay Overview: Modified NIH3T3, transformed to express firefly...
In DepthDetails PCBioAssay
TargetHexokinase-1(Homo sapiens (Human))
Burnham Center For Chemical Genomics
Curated by PubChem BioAssay
LigandPNGBDBM63324(3-[[5-(4-ethylphenyl)-6H-1,3,4-thiadiazin-2-yl]ami...)
Affinity DataEC50:  8.26E+3nM. Assay description: Data Source: Sanford-Burnham Center for Chemical Genomics (SBCCG) Source Affiliation: Sanford-Burnham Medical Research Institute (SBMRI, San Diego, C...
In DepthDetails PCBioAssay
TargetHexokinase HKDC1 [W721R](Homo sapiens (Human))
Burnham Center For Chemical Genomics
Curated by PubChem BioAssay
LigandPNGBDBM63324(3-[[5-(4-ethylphenyl)-6H-1,3,4-thiadiazin-2-yl]ami...)
Affinity DataEC50:  1.03E+4nM. Assay description: Data Source: Sanford-Burnham Center for Chemical Genomics (SBCCG) Source Affiliation: Sanford-Burnham Medical Research Institute (SBMRI, San Diego, C...
In DepthDetails PCBioAssay