BDBM63373 6-[1-(3-chlorophenyl)-1H-pyrazol-5-yl]-2-(3-methoxyphenyl)-4-methyl-1,2,4-triazine-3,5(2H,4H)-dione::6-[2-(3-chlorophenyl)-3-pyrazolyl]-2-(3-methoxyphenyl)-4-methyl-1,2,4-triazine-3,5-dione::6-[2-(3-chlorophenyl)pyrazol-3-yl]-2-(3-methoxyphenyl)-4-methyl-1,2,4-triazine-3,5-dione::6-[2-(3-chlorophenyl)pyrazol-3-yl]-2-(3-methoxyphenyl)-4-methyl-1,2,4-triazine-3,5-quinone::MLS000540395::SMR000125653::cid_1471575
SMILES COc1cccc(c1)-n1nc(-c2ccnn2-c2cccc(Cl)c2)c(=O)n(C)c1=O
InChI Key InChIKey=YNMABTHYZQZTHD-UHFFFAOYSA-N
Data  1 EC50
  Tab Delimited (TSV)   2D SDfile   Computed 3D by Vconf -m prep SDfile
Find this compound or compounds like it in BindingDB:
Activity Spreadsheet -- Enzyme Inhibition Constant Data from BindingDB
Found 1 hit for monomerid = 63373
TargetHeat shock factor protein 1(Mus musculus)
Broad Institute
Curated by PubChem BioAssay
LigandPNGBDBM63373(6-[1-(3-chlorophenyl)-1H-pyrazol-5-yl]-2-(3-methox...)
Affinity DataEC50: >1.95E+5nM. Assay description: Keywords: Heat Shock Factor-1 (HSF-1), Stress Response, MG132, NIH3T3, Luminescence Assay Overview: Modified NIH3T3, transformed to express firefly...
In DepthDetails PCBioAssay