BDBM63395 1,1-bis(oxidanylidene)-N,N-bis(2-prop-2-enoxyethyl)-1,2-benzothiazol-3-amine::1,1-dioxo-N,N-bis(2-prop-2-enoxyethyl)-1,2-benzothiazol-3-amine::MLS000714559::SMR000274538::bis(2-allyloxyethyl)-(1,1-diketo-1,2-benzothiazol-3-yl)amine::cid_1813803
SMILES C=CCOCCN(CCOCC=C)C1=NS(=O)(=O)c2ccccc12
InChI Key InChIKey=KQPZAASXLBRXHR-UHFFFAOYSA-N
Data  1 EC50
  Tab Delimited (TSV)   2D SDfile   Computed 3D by Vconf -m prep SDfile
Find this compound or compounds like it in BindingDB:
Activity Spreadsheet -- Enzyme Inhibition Constant Data from BindingDB
Found 1 hit for monomerid = 63395
TargetHeat shock factor protein 1(Mus musculus)
Broad Institute
Curated by PubChem BioAssay
LigandPNGBDBM63395(1,1-bis(oxidanylidene)-N,N-bis(2-prop-2-enoxyethyl...)
Affinity DataEC50: >1.95E+5nM. Assay description: Keywords: Heat Shock Factor-1 (HSF-1), Stress Response, MG132, NIH3T3, Luminescence Assay Overview: Modified NIH3T3, transformed to express firefly...
In DepthDetails PCBioAssay