BDBM64588 US8486940, 2
SMILES O=C1NCC(C2CCCCC2)N1c1ccc2nc[nH]c2c1
InChI Key
Data  1 IC50
  Tab Delimited (TSV)   2D SDfile   Computed 3D by Vconf -m prep SDfile
Find this compound or compounds like it in BindingDB:
Activity Spreadsheet -- Enzyme Inhibition Constant Data from BindingDB
Found 1 hit for monomerid = 64588
TargetGlutaminyl-peptide cyclotransferase(Homo sapiens (Human))
Probiodrug
US Patent
LigandPNGBDBM64588(US8486940, 2)
Affinity DataIC50: <1.00E+4nM. Assay description: Spectrophotometic Assay: This novel assay was used to determine the kinetic parameters for most of the QC substrates. QC activity was analyzed spect...
In DepthDetails US Patent