BDBM67030 1-(2,3-dihydro-1,4-benzodioxin-6-ylsulfonyl)-4-(2-nitrophenyl)sulfonyl-piperazine::1-(2,3-dihydro-1,4-benzodioxin-6-ylsulfonyl)-4-(2-nitrophenyl)sulfonylpiperazine::MLS002264379::SMR001317681::cid_25886838
SMILES [O-][N+](=O)c1ccccc1S(=O)(=O)N1CCN(CC1)S(=O)(=O)c1ccc2OCCOc2c1
InChI Key InChIKey=QXQZYSGHLQEFCB-UHFFFAOYSA-N
Data  1 EC50
  Tab Delimited (TSV)   2D SDfile   Computed 3D by Vconf -m prep SDfile
Find this compound or compounds like it in BindingDB:
Activity Spreadsheet -- Enzyme Inhibition Constant Data from BindingDB
Found 1 hit for monomerid = 67030
TargetBcl-2-like protein 11(Homo sapiens (Human))
Broad Institute
Curated by PubChem BioAssay
LigandPNGBDBM67030(1-(2,3-dihydro-1,4-benzodioxin-6-ylsulfonyl)-4-(2-...)
Affinity DataEC50: >3.50E+5nM. Assay description: Keywords: apoptosis, BH3 domain, Bcl2-A1, BIM, caspase, cancer Primary Collaborator: Todd Golub, Broad Institute, golub@broadinstitute.org Assay Over...
Ligand InfoPC cidPC sid
In DepthDetails PCBioAssay