BDBM67255 (5Z)-3-morpholino-2-thioxo-5-vanillylidene-thiazolidin-4-one::(5Z)-5-[(3-methoxy-4-oxidanyl-phenyl)methylidene]-3-morpholin-4-yl-2-sulfanylidene-1,3-thiazolidin-4-one::(5Z)-5-[(4-hydroxy-3-methoxyphenyl)methylidene]-3-(4-morpholinyl)-2-sulfanylidene-4-thiazolidinone::(5Z)-5-[(4-hydroxy-3-methoxyphenyl)methylidene]-3-morpholin-4-yl-2-sulfanylidene-1,3-thiazolidin-4-one::5-[1-(4-Hydroxy-3-methoxy-phenyl)-meth-(Z)-ylidene]-3-morpholin-4-yl-2-thioxo-thiazolidin-4-one::MLS000331478::SMR000221016::cid_1860024
SMILES COc1cc(\C=C2/SC(=S)N(N3CCOCC3)C2=O)ccc1O
InChI Key InChIKey=ZISPWOKNJXQCGQ-LCYFTJDESA-N
Data  1 IC50
  Tab Delimited (TSV)   2D SDfile   Computed 3D by Vconf -m prep SDfile
Find this compound or compounds like it in BindingDB:
Activity Spreadsheet -- Enzyme Inhibition Constant Data from BindingDB
Found 1 hit for monomerid = 67255
TargetApelin receptor(Homo sapiens (Human))
Sanford-Burnham Center For Chemical Genomics
Curated by PubChem BioAssay
LigandPNGBDBM67255((5Z)-3-morpholino-2-thioxo-5-vanillylidene-thiazol...)
Affinity DataIC50: >4.00E+4nM. Assay description: Data Source: Sanford-Burnham Center for Chemical Genomics (SBCCG) Source Affiliation: Sanford- Sanford-Burnham Medical Research Institute(SBMRI, San...
In DepthDetails PCBioAssay