BDBM67608 3-[(2Z)-2-(2-oxidanylidenenaphthalen-1-ylidene)hydrazinyl]benzenesulfonic acid::3-[(2Z)-2-(2-oxo-1-naphthalenylidene)hydrazinyl]benzenesulfonic acid::3-[(2Z)-2-(2-oxonaphthalen-1-ylidene)hydrazinyl]benzenesulfonic acid::3-[(N'Z)-N'-(2-keto-1-naphthylidene)hydrazino]besylic acid::MLS000703279::SMR000273743::cid_5360665
SMILES Oc1ccc2ccccc2c1N=Nc1cccc(c1)S(O)(=O)=O
InChI Key InChIKey=SZZYVRCXNNQFKZ-UHFFFAOYSA-N
Data  1 EC50
  Tab Delimited (TSV)   2D SDfile   Computed 3D by Vconf -m prep SDfile
Find this compound or compounds like it in BindingDB:
Activity Spreadsheet -- Enzyme Inhibition Constant Data from BindingDB
Found 1 hit for monomerid = 67608
TargetSerine/threonine-protein kinase 33(Homo sapiens (Human))
Broad Institute
Curated by PubChem BioAssay
LigandPNGBDBM67608(3-[(2Z)-2-(2-oxidanylidenenaphthalen-1-ylidene)hyd...)
Affinity DataEC50:  3.46E+3nM. Assay description: Keywords: STK33 Kinase, Non-ATP Competitive Inhibitor Assay Overview: Purified STK33 Kinase is preincubated with potential inhibitors and allowed to ...
In DepthDetails PCBioAssay