BDBM69223 1-phenyl-3-(4-pyridyl)urea::1-phenyl-3-pyridin-4-yl-urea::1-phenyl-3-pyridin-4-ylurea::MLS000719252::SMR000291520::cid_4074688
SMILES O=C(Nc1ccccc1)Nc1ccncc1
InChI Key InChIKey=WZYOSMAXXLCTGP-UHFFFAOYSA-N
Data  2 IC50  3 EC50
  Tab Delimited (TSV)   2D SDfile   Computed 3D by Vconf -m prep SDfile
Find this compound or compounds like it in BindingDB:
Activity Spreadsheet -- Enzyme Inhibition Constant Data from BindingDB
Found 5 hits for monomerid = 69223
TargetGlycogen synthase kinase-3 beta(Homo sapiens (Human))
Broad Institute
Curated by PubChem BioAssay
LigandPNGBDBM69223(1-phenyl-3-(4-pyridyl)urea | 1-phenyl-3-pyridin-4-...)
Affinity DataEC50: >3.00E+5nM. Assay description: Keywords: GSK3beta, dose response, kinase, inhibition, HTS Assay Overview: The glycogen synthase kinase-3 beta (GSK-3b) is a known master regulator f...
In DepthDetails PCBioAssay
TargetGuanine nucleotide-binding protein subunit alpha-15(Homo sapiens (Human))
The Scripps Research Institute Molecular Screening Center
Curated by PubChem BioAssay
LigandPNGBDBM69223(1-phenyl-3-(4-pyridyl)urea | 1-phenyl-3-pyridin-4-...)
Affinity DataEC50: >2.99E+4nM
In DepthDetails PCBioAssay
TargetGuanine nucleotide-binding protein subunit alpha-15(Homo sapiens (Human))
The Scripps Research Institute Molecular Screening Center
Curated by PubChem BioAssay
LigandPNGBDBM69223(1-phenyl-3-(4-pyridyl)urea | 1-phenyl-3-pyridin-4-...)
Affinity DataIC50: >2.99E+4nM
In DepthDetails PCBioAssay
TargetTrace amine-associated receptor 1(Homo sapiens (Human))
The Scripps Research Institute Molecular Screening Center
Curated by PubChem BioAssay
LigandPNGBDBM69223(1-phenyl-3-(4-pyridyl)urea | 1-phenyl-3-pyridin-4-...)
Affinity DataEC50:  1.02E+3nM
In DepthDetails PCBioAssay
TargetTrace amine-associated receptor 1(Homo sapiens (Human))
The Scripps Research Institute Molecular Screening Center
Curated by PubChem BioAssay
LigandPNGBDBM69223(1-phenyl-3-(4-pyridyl)urea | 1-phenyl-3-pyridin-4-...)
Affinity DataIC50:  7.05E+3nM
In DepthDetails PCBioAssay