BDBM70698 US9693997, 217
SMILES CC(C)(C)NS(=O)(=O)c1ccc(cc1OC(F)(F)F)-c1c(Cl)cc(Nc2n[nH]c(N)n2)cc1C(F)(F)F
InChI Key InChIKey=XTAAFFLURUTZCB-UHFFFAOYSA-N
Data  1 EC50
  Tab Delimited (TSV)   2D SDfile   Computed 3D by Vconf -m prep SDfile
Find this compound or compounds like it in BindingDB:
Activity Spreadsheet -- Enzyme Inhibition Constant Data from BindingDB
Found 1 hit for monomerid = 70698
TargetGenome polyprotein(Hepatitis C virus (HCV))
Hoffmann-La Roche
US Patent
LigandPNGBDBM70698(US9693997, 217)
Affinity DataEC50:  3nM. Assay description: Plasmids expressing HCV E1 and E2 envelope proteins of GT1a H77 strain (Proc Natl Acad Sci USA 1997 94:8738-43) or GT1b Con1 strain (Science 1999 285...
In DepthDetails US Patent