BDBM7094 3-Aminopyrazole deriv. 4::N-(5-Cyclopropyl-1H-pyrazol-3-yl)-2-fluoro-2-phenylacetamide
SMILES FC(C(=O)Nc1cc(n[nH]1)C1CC1)c1ccccc1
InChI Key InChIKey=QFPGZNFSVUUBNZ-UHFFFAOYSA-N
Data  1 IC50
  Tab Delimited (TSV)   2D SDfile   Computed 3D by Vconf -m prep SDfile
Find this compound or compounds like it in BindingDB:
Activity Spreadsheet -- Enzyme Inhibition Constant Data from BindingDB
Found 1 hit for monomerid = 7094
TargetCyclin-A2/Cyclin-dependent kinase 2(Homo sapiens (Human))
Nerviano Medical Sciences
LigandPNGBDBM7094(3-Aminopyrazole deriv. 4 | N-(5-Cyclopropyl-1H-pyr...)
Affinity DataIC50:  99nMpH: 7.4 T: 2°C. Assay description: The biochemical activity of compounds was determined by incubation with specific enzymes and substrates in the presence ATP/[gamma-33P] ATP. After in...
In DepthDetails ArticlePubMed