BDBM7154 3-Phenylacetamidoaminopyrazole deriv. 31::4-{2-[(5-Cyclopropyl-1H-pyrazol-3-yl)amino]-2-oxo-ethyl}benzamide::4-{[(5-cyclopropyl-1H-pyrazol-3-yl)carbamoyl]methyl}benzamide::CHEMBL324577
SMILES NC(=O)c1ccc(CC(=O)Nc2cc(n[nH]2)C2CC2)cc1
InChI Key InChIKey=RJESYXNLLLQOLH-UHFFFAOYSA-N
Data  2 IC50
  Tab Delimited (TSV)   2D SDfile   Computed 3D by Vconf -m prep SDfile
Find this compound or compounds like it in BindingDB:
Activity Spreadsheet -- Enzyme Inhibition Constant Data from BindingDB
Found 2 hits for monomerid = 7154
TargetCyclin-dependent kinase 2(Homo sapiens (Human))
Institute Of Chemical Biology (Csir)
Curated by ChEMBL
LigandPNGBDBM7154(3-Phenylacetamidoaminopyrazole deriv. 31 | 4-{2-[(...)
Affinity DataIC50:  74nM. Assay description: Inhibition of CDK2/Cyclin A (unknown origin)
In DepthDetails ArticlePubMed
TargetCyclin-A2/Cyclin-dependent kinase 2(Homo sapiens (Human))
Pharmacia Italia
LigandPNGBDBM7154(3-Phenylacetamidoaminopyrazole deriv. 31 | 4-{2-[(...)
Affinity DataIC50:  74nM. Assay description: The biochemical activity of compounds was determined by incubation with specific enzymes and substrates in the presence ATP/[gamma-33P] ATP. After in...
In DepthDetails ArticlePubMed