BDBM7162 3-Phenylacetamidoaminopyrazole deriv. 39::4 -{2-[(5-Cyclopropyl-1H-pyrazol-3-yl)amino]-2-oxoethyl}-1,1 -biphenyl-4-carboxamide::4-(4-{[(5-cyclopropyl-1H-pyrazol-3-yl)carbamoyl]methyl}phenyl)benzamide
SMILES NC(=O)c1ccc(cc1)-c1ccc(CC(=O)Nc2cc(n[nH]2)C2CC2)cc1
InChI Key InChIKey=HHYDLEDJMDNGIO-UHFFFAOYSA-N
Data  1 IC50
  Tab Delimited (TSV)   2D SDfile   Computed 3D by Vconf -m prep SDfile
Find this compound or compounds like it in BindingDB:
Activity Spreadsheet -- Enzyme Inhibition Constant Data from BindingDB
Found 1 hit for monomerid = 7162
TargetCyclin-A2/Cyclin-dependent kinase 2(Homo sapiens (Human))
Pharmacia Italia
LigandPNGBDBM7162(3-Phenylacetamidoaminopyrazole deriv. 39 | 4 -{2-[...)
Affinity DataIC50:  4nM. Assay description: The biochemical activity of compounds was determined by incubation with specific enzymes and substrates in the presence ATP/[gamma-33P] ATP. After in...
In DepthDetails ArticlePubMed