BDBM73856 MLS001183488::N-[2-(5-methoxy-1H-indol-3-yl)ethyl]cyclohexanecarboxamide::SMR000502033::cid_2987849
SMILES COc1ccc2[nH]cc(CCNC(=O)C3CCCCC3)c2c1
InChI Key InChIKey=WJWJUOXBPYEUQP-UHFFFAOYSA-N
Data  1 EC50
  Tab Delimited (TSV)   2D SDfile   Computed 3D by Vconf -m prep SDfile
Find this compound or compounds like it in BindingDB:
Activity Spreadsheet -- Enzyme Inhibition Constant Data from BindingDB
Found 1 hit for monomerid = 73856
TargetProtein LANA1(Human herpesvirus 8)
Broad Institute
Curated by PubChem BioAssay
LigandPNGBDBM73856(MLS001183488 | N-[2-(5-methoxy-1H-indol-3-yl)ethyl...)
Affinity DataEC50: >7.50E+4nM. Assay description: Primary Collaborators: Kenneth Kaye,Brigham & Womens,Boston MA,kkaye@rics.bwh.harvard.edu,617-525-4256 Chantal Beauchemin,Brigham & Womens,Boston MA,...
In DepthDetails PCBioAssay