BDBM74209 MLS001071643::N-ethyl-2-(2-oxidanylidene-2-pyrrolidin-1-yl-ethyl)sulfanyl-N-[2-oxidanylidene-2-[[2-(trifluoromethyl)phenyl]amino]ethyl]benzamide::N-ethyl-2-(2-oxo-2-pyrrolidin-1-ylethyl)sulfanyl-N-[2-oxo-2-[2-(trifluoromethyl)anilino]ethyl]benzamide::N-ethyl-2-[(2-keto-2-pyrrolidino-ethyl)thio]-N-[2-keto-2-[2-(trifluoromethyl)anilino]ethyl]benzamide::N-ethyl-2-[[2-oxo-2-(1-pyrrolidinyl)ethyl]thio]-N-[2-oxo-2-[2-(trifluoromethyl)anilino]ethyl]benzamide::SMR000714349::cid_24978703
SMILES CCN(CC(=O)Nc1ccccc1C(F)(F)F)C(=O)c1ccccc1SCC(=O)N1CCCC1
InChI Key InChIKey=ZYFDMSPNUSXZEY-UHFFFAOYSA-N
Data  1 EC50
  Tab Delimited (TSV)   2D SDfile   Computed 3D by Vconf -m prep SDfile
Find this compound or compounds like it in BindingDB:
Activity Spreadsheet -- Enzyme Inhibition Constant Data from BindingDB
Found 1 hit for monomerid = 74209
TargetProtein LANA1(Human herpesvirus 8)
Broad Institute
Curated by PubChem BioAssay
LigandPNGBDBM74209(MLS001071643 | N-ethyl-2-(2-oxidanylidene-2-pyrrol...)
Affinity DataEC50: >7.50E+4nM. Assay description: Primary Collaborators: Kenneth Kaye,Brigham & Womens,Boston MA,kkaye@rics.bwh.harvard.edu,617-525-4256 Chantal Beauchemin,Brigham & Womens,Boston MA,...
In DepthDetails PCBioAssay