BDBM77373 6-bromanyl-1,5,5-trimethyl-N-(3-methylphenyl)bicyclo[2.1.1]hexane-4-carboxamide::6-bromo-1,5,5-trimethyl-N-(3-methylphenyl)-4-bicyclo[2.1.1]hexanecarboxamide::6-bromo-1,5,5-trimethyl-N-(3-methylphenyl)bicyclo[2.1.1]hexane-4-carboxamide::6-bromo-1,5,5-trimethyl-N-(m-tolyl)bicyclo[2.1.1]hexane-4-carboxamide::6-bromo-4,5,5-trimethyl-N-(3-methylphenyl)bicyclo[2.1.1]hexane-1-carboxamide::MLS000543760::SMR000163006::cid_4405466
SMILES Cc1cccc(NC(=O)C23CCC(C)(C2Br)C3(C)C)c1
InChI Key InChIKey=WHTXJHNIWIEXAU-UHFFFAOYSA-N
Data  2 EC50
  Tab Delimited (TSV)   2D SDfile   Computed 3D by Vconf -m prep SDfile
Find this compound or compounds like it in BindingDB:
Activity Spreadsheet -- Enzyme Inhibition Constant Data from BindingDB
Found 2 hits for monomerid = 77373
TargetVoltage-dependent T-type calcium channel subunit alpha-1H(Homo sapiens (Human))
Vanderbilt Screening Center For Gpcrs, Ion Channels And Transporters
Curated by PubChem BioAssay
LigandPNGBDBM77373(6-bromanyl-1,5,5-trimethyl-N-(3-methylphenyl)bicyc...)
Affinity DataEC50:  2.64E+3nM. Assay description: Assay Provider: Xinmin Xie Assay Provider Affiliation: Bioscience Division, SRI International, Menlo Park, CA Grant Title: HTS Assay for Cav3 T-Type ...
In DepthDetails PCBioAssay
TargetVoltage-dependent T-type calcium channel subunit alpha-1H(Homo sapiens (Human))
Vanderbilt Screening Center For Gpcrs, Ion Channels And Transporters
Curated by PubChem BioAssay
LigandPNGBDBM77373(6-bromanyl-1,5,5-trimethyl-N-(3-methylphenyl)bicyc...)
Affinity DataEC50:  5.25E+3nM. Assay description: Assay Provider: Xinmin Xie Assay Provider Affiliation: Bioscience Division, SRI International, Menlo Park, CA Grant Title: HTS Assay for Cav3 T-Type ...
In DepthDetails PCBioAssay