BDBM77517 1-ethyl-6-fluoro-4-keto-7-morpholino-quinoline-3-carboxylic acid ethyl ester::1-ethyl-6-fluoro-7-(4-morpholinyl)-4-oxo-3-quinolinecarboxylic acid ethyl ester::MLS000109278::SMR000105223::cid_685280::ethyl 1-ethyl-6-fluoranyl-7-morpholin-4-yl-4-oxidanylidene-quinoline-3-carboxylate::ethyl 1-ethyl-6-fluoro-7-morpholin-4-yl-4-oxoquinoline-3-carboxylate
SMILES CCOC(=O)c1cn(CC)c2cc(N3CCOCC3)c(F)cc2c1=O
InChI Key InChIKey=KTNXGEUGDNFEAV-UHFFFAOYSA-N
Data  1 IC50
  Tab Delimited (TSV)   2D SDfile   Computed 3D by Vconf -m prep SDfile
Find this compound or compounds like it in BindingDB:
Activity Spreadsheet -- Enzyme Inhibition Constant Data from BindingDB
Found 1 hit for monomerid = 77517
TargetRecBCD enzyme subunit RecD(Escherichia coli str. K-12 substr. MG1655)
The Scripps Research Institute Molecular Screening Center
Curated by PubChem BioAssay
LigandPNGBDBM77517(1-ethyl-6-fluoro-4-keto-7-morpholino-quinoline-3-c...)
Affinity DataIC50: >1.19E+5nM. Assay description: Source (MLPCN Center Name): The Scripps Research Institute Molecular Screening Center (SRIMSC) Affiliation: The Scripps Research Institute, TSRI Assa...
In DepthDetails PCBioAssay