BDBM78671 1-[(2-keto-5-nitro-indol-3-yl)amino]-3-(tetrahydrofurfuryl)thiourea::1-[(5-nitro-2-oxidanylidene-indol-3-yl)amino]-3-(oxolan-2-ylmethyl)thiourea::1-[(5-nitro-2-oxo-3-indolyl)amino]-3-(2-oxolanylmethyl)thiourea::1-[(5-nitro-2-oxoindol-3-yl)amino]-3-(oxolan-2-ylmethyl)thiourea::MLS000417334::SMR000242561::cid_5800378
SMILES [O-][N+](=O)c1ccc2[N-]C(=O)C(=[NH+]NC(=S)NCC3CCCO3)c2c1
InChI Key InChIKey=DKBQBTWHTJRXMY-UHFFFAOYSA-N
Data  3 IC50
  Tab Delimited (TSV)   2D SDfile   Computed 3D by Vconf -m prep SDfile
Find this compound or compounds like it in BindingDB:
Activity Spreadsheet -- Enzyme Inhibition Constant Data from BindingDB
Found 3 hits for monomerid = 78671
TargetUbiquitin-conjugating enzyme E2 N(Homo sapiens (Human))
Burnham Center For Chemical Genomics
Curated by PubChem BioAssay
LigandPNGBDBM78671(1-[(2-keto-5-nitro-indol-3-yl)amino]-3-(tetrahydro...)
Affinity DataIC50:  1.59E+4nM. Assay description: Data Source: Sanford-Burnham Center for Chemical Genomics (SBCCG) Source Affiliation: Sanford-Burnham Medical Research Institute (SBMRI, San Diego CA...
In DepthDetails PCBioAssay
TargetUbiquitin-conjugating enzyme E2 N(Homo sapiens (Human))
Burnham Center For Chemical Genomics
Curated by PubChem BioAssay
LigandPNGBDBM78671(1-[(2-keto-5-nitro-indol-3-yl)amino]-3-(tetrahydro...)
Affinity DataIC50:  664nM. Assay description: Data Source: Sanford-Burnham Center for Chemical Genomics (SBCCG) Source Affiliation: Sanford-Burnham Medical Research Institute (SBMRI, San Diego CA...
In DepthDetails PCBioAssay
TargetBcl-2-related protein A1(Mus musculus (Mouse))
Burnham Center For Chemical Genomics
Curated by PubChem BioAssay
LigandPNGBDBM78671(1-[(2-keto-5-nitro-indol-3-yl)amino]-3-(tetrahydro...)
Affinity DataIC50: >2.00E+4nM. Assay description: Data Source: Sanford-Burnham Center for Chemical Genomics (SBCCG) Source Affiliation: Sanford-Burnham Medical Research Institute (SBMRI, San Diego CA...
In DepthDetails PCBioAssay