BDBM78988 MLS001199304::N-[2-[butyl(ethyl)amino]ethyl]-5-ethyl-4-keto-thieno[3,2-c]quinoline-2-carboxamide::N-[2-[butyl(ethyl)amino]ethyl]-5-ethyl-4-oxidanylidene-thieno[3,2-c]quinoline-2-carboxamide::N-[2-[butyl(ethyl)amino]ethyl]-5-ethyl-4-oxo-2-thieno[3,2-c]quinolinecarboxamide::N-[2-[butyl(ethyl)amino]ethyl]-5-ethyl-4-oxothieno[3,2-c]quinoline-2-carboxamide::N-{2-[butyl(ethyl)amino]ethyl}-5-ethyl-4-oxo-4,5-dihydrothieno[3,2-c]quinoline-2-carboxamide::SMR000562883::cid_16008982
SMILES CCCCN(CC)CCNC(=O)c1cc2c(s1)c1ccccc1n(CC)c2=O
InChI Key InChIKey=MGZQBFIKMRBTMI-UHFFFAOYSA-N
Data  3 IC50
  Tab Delimited (TSV)   2D SDfile   Computed 3D by Vconf -m prep SDfile
Find this compound or compounds like it in BindingDB:
Activity Spreadsheet -- Enzyme Inhibition Constant Data from BindingDB
Found 3 hits for monomerid = 78988
TargetBcl-2-related protein A1(Mus musculus (Mouse))
Burnham Center For Chemical Genomics
Curated by PubChem BioAssay
LigandPNGBDBM78988(MLS001199304 | N-[2-[butyl(ethyl)amino]ethyl]-5-et...)
Affinity DataIC50: >2.00E+4nM. Assay description: Data Source: Sanford-Burnham Center for Chemical Genomics (SBCCG) Source Affiliation: Sanford-Burnham Medical Research Institute (SBMRI, San Diego CA...
In DepthDetails PCBioAssay
TargetUbiquitin-conjugating enzyme E2 N(Homo sapiens (Human))
Burnham Center For Chemical Genomics
Curated by PubChem BioAssay
LigandPNGBDBM78988(MLS001199304 | N-[2-[butyl(ethyl)amino]ethyl]-5-et...)
Affinity DataIC50:  5.26E+3nM. Assay description: Data Source: Sanford-Burnham Center for Chemical Genomics (SBCCG) Source Affiliation: Sanford-Burnham Medical Research Institute (SBMRI, San Diego CA...
In DepthDetails PCBioAssay
TargetUbiquitin-conjugating enzyme E2 N(Homo sapiens (Human))
Burnham Center For Chemical Genomics
Curated by PubChem BioAssay
LigandPNGBDBM78988(MLS001199304 | N-[2-[butyl(ethyl)amino]ethyl]-5-et...)
Affinity DataIC50:  1.81E+4nM. Assay description: Data Source: Sanford-Burnham Center for Chemical Genomics (SBCCG) Source Affiliation: Sanford-Burnham Medical Research Institute (SBMRI, San Diego CA...
In DepthDetails PCBioAssay