BDBM7937 1-(3,4-dimethoxyphenyl)-N-[3-(1H-imidazol-1-yl)propyl]cyclopropane-1-carbothioamide::N-(3-(1H-Imidazol-1-yl)propyl)-1-(3,4-dimethoxyphenyl)cyclopropanecarbothioamide::thioamide deriv. 81
SMILES COc1ccc(cc1OC)C1(CC1)C(=S)NCCCn1ccnc1
InChI Key InChIKey=HNOOCSFLRCFDKF-UHFFFAOYSA-N
Data  2 KI
  Tab Delimited (TSV)   2D SDfile   Computed 3D by Vconf -m prep SDfile
Find this compound or compounds like it in BindingDB:
Activity Spreadsheet -- Enzyme Inhibition Constant Data from BindingDB
Found 2 hits for monomerid = 7937
TargetGlutaminyl-peptide cyclotransferase(Homo sapiens (Human))
Probiodrug
Curated by ChEMBL
LigandPNGBDBM7937(1-(3,4-dimethoxyphenyl)-N-[3-(1H-imidazol-1-yl)pro...)
Affinity DataKi:  90nM. Assay description: Inhibition of human glutaminyl cyclase expressed in Pichia pastoris by pGAP coupled enzyme assay
In DepthDetails ArticlePubMed
TargetGlutaminyl-peptide cyclotransferase(Homo sapiens (Human))
Probiodrug
Curated by ChEMBL
LigandPNGBDBM7937(1-(3,4-dimethoxyphenyl)-N-[3-(1H-imidazol-1-yl)pro...)
Affinity DataKi:  90nM. Assay description: QC activity was evaluated fluorometrically using Gln-AMC as substrate, and pyroglutamyl peptidase as the auxiliary enzyme. After conversion of Gln-AM...
In DepthDetails ArticlePubMed