BDBM8030 (2S)-N-[(2S,3S)-4-{[(1S)-1-carbamoyl-2-[3-(2-methoxyphenyl)phenyl]ethyl]amino}-3-hydroxy-1-phenylbutan-2-yl]-3-methyl-2-(pyridin-2-ylformamido)butanamide::(2S,5S,6R)-3-Aza-5-hydroxy-2-[m-(o-methoxyphenyl)-benzyl]-7-phenyl-6-[(picolyl-L-valinyl)amino]heptanoyl Amide::hydroxyethylamine-based inhibitor 17d
SMILES COc1ccccc1-c1cccc(C[C@H](NC[C@H](O)[C@H](Cc2ccccc2)NC(=O)[C@@H](NC(=O)c2ccccn2)C(C)C)C(N)=O)c1
InChI Key InChIKey=NHXBRMTYDNOYDY-SUGCFTRWSA-N
Data  3 KI
  Tab Delimited (TSV)   2D SDfile   Computed 3D by Vconf -m prep SDfile
Find this compound or compounds like it in BindingDB:
Activity Spreadsheet -- Enzyme Inhibition Constant Data from BindingDB
Found 3 hits for monomerid = 8030
TargetPlasmepsin I(Plasmodium falciparum)
Uppsala University
LigandPNGBDBM8030((2S)-N-[(2S,3S)-4-{[(1S)-1-carbamoyl-2-[3-(2-metho...)
Affinity DataKi:  1.30E+3nM. Assay description: Enzyme activities were assayed by monitoring the hydrolysis of substrate in the presence or absence of inhibitor compounds. The hydrolysis was record...
In DepthDetails ArticlePubMed
TargetPlasmepsin II(Plasmodium falciparum)
Uppsala University
LigandPNGBDBM8030((2S)-N-[(2S,3S)-4-{[(1S)-1-carbamoyl-2-[3-(2-metho...)
Affinity DataKi:  1.43E+3nM. Assay description: Enzyme activities were assayed by monitoring the hydrolysis of substrate in the presence or absence of inhibitor compounds. The hydrolysis was record...
In DepthDetails ArticlePubMed
TargetCathepsin D(Homo sapiens (Human))
Uppsala University
LigandPNGBDBM8030((2S)-N-[(2S,3S)-4-{[(1S)-1-carbamoyl-2-[3-(2-metho...)
Affinity DataKi: >2.00E+3nM. Assay description: Enzyme activities were assayed by monitoring the hydrolysis of substrate in the presence or absence of inhibitor compounds. The hydrolysis was record...
In DepthDetails ArticlePubMed