BDBM80815 MLS002701847::N-(1-thiazol-2-ylethylideneamino)-3-azabicyclo[3.2.2]nonane-3-carbothioamide::N-[1-(1,3-thiazol-2-yl)ethylideneamino]-3-azabicyclo[3.2.2]nonane-3-carbothioamide::N-[1-(2-thiazolyl)ethylideneamino]-3-azabicyclo[3.2.2]nonane-3-carbothioamide::SMR001565439::cid_3003955
SMILES CC(=NNC(=S)N1CC2CCC(CC2)C1)c1nccs1
InChI Key InChIKey=OHHANFDQXBLKIW-UHFFFAOYSA-N
Data  2 EC50
  Tab Delimited (TSV)   2D SDfile   Computed 3D by Vconf -m prep SDfile
Find this compound or compounds like it in BindingDB:
Activity Spreadsheet -- Enzyme Inhibition Constant Data from BindingDB
Found 2 hits for monomerid = 80815
TargetHexokinase-1(Homo sapiens (Human))
Burnham Center For Chemical Genomics
Curated by PubChem BioAssay
LigandPNGBDBM80815(MLS002701847 | N-(1-thiazol-2-ylethylideneamino)-3...)
Affinity DataEC50: >8.00E+4nM. Assay description: Data Source: Sanford-Burnham Center for Chemical Genomics (SBCCG) Source Affiliation: Sanford-Burnham Medical Research Institute (SBMRI, San Diego, C...
Ligand InfoPC cidPC sid
In DepthDetails PCBioAssay
TargetHexokinase HKDC1 [W721R](Homo sapiens (Human))
Burnham Center For Chemical Genomics
Curated by PubChem BioAssay
LigandPNGBDBM80815(MLS002701847 | N-(1-thiazol-2-ylethylideneamino)-3...)
Affinity DataEC50:  1.83E+3nM. Assay description: Data Source: Sanford-Burnham Center for Chemical Genomics (SBCCG) Source Affiliation: Sanford-Burnham Medical Research Institute (SBMRI, San Diego, C...
Ligand InfoPC cidPC sid
In DepthDetails PCBioAssay