BDBM8085 (2S)-N-[(2S,3S)-4-{[(1S)-2-(4-bromophenyl)-1-carbamoylethyl]amino}-3-hydroxy-1-phenylbutan-2-yl]-2-(furan-3-ylformamido)-3-methylbutanamide::hydroxylethylamine scaffold 54::hydroxylethylamine scaffold 5{4}
SMILES CC(C)[C@H](NC(=O)c1ccoc1)C(=O)N[C@@H](Cc1ccccc1)[C@@H](O)CN[C@@H](Cc1ccc(Br)cc1)C(N)=O
InChI Key InChIKey=KSAHSUIJWHTLPI-CQJMVLFOSA-N
Data  3 KI
  Tab Delimited (TSV)   2D SDfile   Computed 3D by Vconf -m prep SDfile
Find this compound or compounds like it in BindingDB:
Activity Spreadsheet -- Enzyme Inhibition Constant Data from BindingDB
Found 3 hits for monomerid = 8085
TargetPlasmepsin I(Plasmodium falciparum)
Uppsala University
LigandPNGBDBM8085((2S)-N-[(2S,3S)-4-{[(1S)-2-(4-bromophenyl)-1-carba...)
Affinity DataKi:  200nM. Assay description: Enzyme activities were assayed by monitoring the hydrolysis of substrate in the presence or absence of inhibitor compounds. The hydrolysis was record...
In DepthDetails ArticlePubMed
TargetPlasmepsin II(Plasmodium falciparum)
Uppsala University
LigandPNGBDBM8085((2S)-N-[(2S,3S)-4-{[(1S)-2-(4-bromophenyl)-1-carba...)
Affinity DataKi:  1.20E+3nM ΔG°:  -7.99kcal/molepH: 4.5 T: 2°C. Assay description: Enzyme activities were assayed by monitoring the hydrolysis of substrate in the presence or absence of inhibitor compounds. The hydrolysis was record...
In DepthDetails ArticlePubMed
TargetCathepsin D(Homo sapiens (Human))
Uppsala University
LigandPNGBDBM8085((2S)-N-[(2S,3S)-4-{[(1S)-2-(4-bromophenyl)-1-carba...)
Affinity DataKi: >2.90E+3nM. Assay description: Enzyme activities were assayed by monitoring the hydrolysis of substrate in the presence or absence of inhibitor compounds. The hydrolysis was record...
In DepthDetails ArticlePubMed