BDBM8089 (2S)-N-[(2S,3S)-4-{[(1S)-2-(4-bromophenyl)-1-carbamoylethyl]amino}-3-hydroxy-1-phenylbutan-2-yl]-2-[(2,3-dimethoxyphenyl)formamido]-3-methylbutanamide::hydroxylethylamine scaffold 58::hydroxylethylamine scaffold 5{8}
SMILES COc1cccc(C(=O)N[C@@H](C(C)C)C(=O)N[C@@H](Cc2ccccc2)[C@@H](O)CN[C@@H](Cc2ccc(Br)cc2)C(N)=O)c1OC
InChI Key InChIKey=DOFWARZRCWUXKJ-QFVIIZQESA-N
Data  3 KI
  Tab Delimited (TSV)   2D SDfile   Computed 3D by Vconf -m prep SDfile
Find this compound or compounds like it in BindingDB:
Activity Spreadsheet -- Enzyme Inhibition Constant Data from BindingDB
Found 3 hits for monomerid = 8089
TargetPlasmepsin I(Plasmodium falciparum)
Uppsala University
LigandPNGBDBM8089((2S)-N-[(2S,3S)-4-{[(1S)-2-(4-bromophenyl)-1-carba...)
Affinity DataKi:  180nM. Assay description: Enzyme activities were assayed by monitoring the hydrolysis of substrate in the presence or absence of inhibitor compounds. The hydrolysis was record...
In DepthDetails ArticlePubMed
TargetPlasmepsin II(Plasmodium falciparum)
Uppsala University
LigandPNGBDBM8089((2S)-N-[(2S,3S)-4-{[(1S)-2-(4-bromophenyl)-1-carba...)
Affinity DataKi:  810nM ΔG°:  -8.22kcal/molepH: 4.5 T: 2°C. Assay description: Enzyme activities were assayed by monitoring the hydrolysis of substrate in the presence or absence of inhibitor compounds. The hydrolysis was record...
In DepthDetails ArticlePubMed
TargetCathepsin D(Homo sapiens (Human))
Uppsala University
LigandPNGBDBM8089((2S)-N-[(2S,3S)-4-{[(1S)-2-(4-bromophenyl)-1-carba...)
Affinity DataKi: >2.90E+3nM. Assay description: Enzyme activities were assayed by monitoring the hydrolysis of substrate in the presence or absence of inhibitor compounds. The hydrolysis was record...
In DepthDetails ArticlePubMed