BDBM8091 (2E)-N-[(1S)-1-{[(2S,3S)-4-{[(1S)-2-(4-bromophenyl)-1-carbamoylethyl]amino}-3-hydroxy-1-phenylbutan-2-yl]carbamoyl}-2-methylpropyl]-N'-(3-ethoxyphenyl)but-2-enediamide::hydroxylethylamine scaffold 50::hydroxylethylamine scaffold 5{10}
SMILES CCOc1cccc(NC(=O)\C=C\C(=O)N[C@@H](C(C)C)C(=O)N[C@@H](Cc2ccccc2)[C@@H](O)CN[C@@H](Cc2ccc(Br)cc2)C(N)=O)c1
InChI Key InChIKey=LAHQEHNTHAUTTK-NHEHZLCWSA-N
Data  3 KI
  Tab Delimited (TSV)   2D SDfile   Computed 3D by Vconf -m prep SDfile
Find this compound or compounds like it in BindingDB:
Activity Spreadsheet -- Enzyme Inhibition Constant Data from BindingDB
Found 3 hits for monomerid = 8091
TargetPlasmepsin I(Plasmodium falciparum)
Uppsala University
LigandPNGBDBM8091((2E)-N-[(1S)-1-{[(2S,3S)-4-{[(1S)-2-(4-bromophenyl...)
Affinity DataKi:  63nM. Assay description: Enzyme activities were assayed by monitoring the hydrolysis of substrate in the presence or absence of inhibitor compounds. The hydrolysis was record...
Ligand InfoPC cidPC sid
In DepthDetails ArticlePubMed
TargetPlasmepsin II(Plasmodium falciparum)
Uppsala University
LigandPNGBDBM8091((2E)-N-[(1S)-1-{[(2S,3S)-4-{[(1S)-2-(4-bromophenyl...)
Affinity DataKi:  690nM ΔG°:  -8.31kcal/molepH: 4.5 T: 2°C. Assay description: Enzyme activities were assayed by monitoring the hydrolysis of substrate in the presence or absence of inhibitor compounds. The hydrolysis was record...
Ligand InfoPC cidPC sid
In DepthDetails ArticlePubMed
TargetCathepsin D(Homo sapiens (Human))
Uppsala University
LigandPNGBDBM8091((2E)-N-[(1S)-1-{[(2S,3S)-4-{[(1S)-2-(4-bromophenyl...)
Affinity DataKi: >2.90E+3nM. Assay description: Enzyme activities were assayed by monitoring the hydrolysis of substrate in the presence or absence of inhibitor compounds. The hydrolysis was record...
Ligand InfoPC cidPC sid
In DepthDetails ArticlePubMed