BDBM8112 (2S)-N-[(2S,3S)-4-{[(1S)-2-[4-(1-benzofuran-2-yl)phenyl]-1-carbamoylethyl]amino}-3-hydroxy-1-phenylbutan-2-yl]-2-(furan-3-ylformamido)-3-methylbutanamide::hydroxylethylamine scaffold 114::hydroxylethylamine scaffold 11{4}
SMILES CC(C)[C@H](NC(=O)c1ccoc1)C(=O)N[C@@H](Cc1ccccc1)[C@@H](O)CN[C@@H](Cc1ccc(cc1)-c1cc2ccccc2o1)C(N)=O
InChI Key InChIKey=SZEHVOBNBMNMCC-MEROQGEASA-N
Data  3 KI
  Tab Delimited (TSV)   2D SDfile   Computed 3D by Vconf -m prep SDfile
Find this compound or compounds like it in BindingDB:
Activity Spreadsheet -- Enzyme Inhibition Constant Data from BindingDB
Found 3 hits for monomerid = 8112
TargetPlasmepsin I(Plasmodium falciparum)
Uppsala University
LigandPNGBDBM8112((2S)-N-[(2S,3S)-4-{[(1S)-2-[4-(1-benzofuran-2-yl)p...)
Affinity DataKi:  54nM. Assay description: Enzyme activities were assayed by monitoring the hydrolysis of substrate in the presence or absence of inhibitor compounds. The hydrolysis was record...
In DepthDetails ArticlePubMed
TargetPlasmepsin II(Plasmodium falciparum)
Uppsala University
LigandPNGBDBM8112((2S)-N-[(2S,3S)-4-{[(1S)-2-[4-(1-benzofuran-2-yl)p...)
Affinity DataKi:  110nM. Assay description: Enzyme activities were assayed by monitoring the hydrolysis of substrate in the presence or absence of inhibitor compounds. The hydrolysis was record...
In DepthDetails ArticlePubMed
TargetCathepsin D(Homo sapiens (Human))
Uppsala University
LigandPNGBDBM8112((2S)-N-[(2S,3S)-4-{[(1S)-2-[4-(1-benzofuran-2-yl)p...)
Affinity DataKi:  1.10E+3nM. Assay description: Enzyme activities were assayed by monitoring the hydrolysis of substrate in the presence or absence of inhibitor compounds. The hydrolysis was record...
In DepthDetails ArticlePubMed