BDBM81531 [D-Phe2]PACAP-38::[DPhe2]PACAP(1-38)
SMILES CCC(C)[C@H](NC(=O)CNC(=O)[C@H](CC(O)=O)NC(=O)[C@@H](Cc1ccccc1)NC(=O)[C@@H](N)Cc1cnc[nH]1)C(=O)N[C@@H](Cc1ccccc1)C(=O)N[C@@H]([C@@H](C)O)C(=O)N[C@@H](CC(O)=O)C(=O)N[C@@H](CO)C(=O)N[C@@H](Cc1ccc(O)cc1)C(=O)N[C@@H](CO)C(=O)N[C@@H](CCCNC(N)=N)C(=O)N[C@@H](Cc1ccc(O)cc1)C(=O)N[C@@H](CCCNC(N)=N)C(=O)N[C@@H](CCCCN)C(=O)N[C@@H](CCC(N)=O)C(=O)N[C@@H](CCSC)C(=O)N[C@@H](C)C(=O)N[C@@H](C(C)C)C(=O)N[C@@H](CCCCN)C(=O)N[C@@H](CCCCN)C(=O)N[C@@H](Cc1ccc(O)cc1)C(=O)N[C@@H](CC(C)C)C(=O)N[C@@H](C)C(=O)N[C@@H](C)C(=O)N[C@@H](C(C)C)C(=O)N[C@@H](CC(C)C)C(=O)NCC(=O)N[C@@H](CCCCN)C(=O)N[C@@H](CCCNC(N)=N)C(=O)N[C@@H](Cc1ccc(O)cc1)C(=O)N[C@@H](CCCCN)C(=O)N[C@@H](CCC(N)=O)C(=O)N[C@@H](CCCNC(N)=N)C(=O)N[C@@H](C(C)C)C(=O)N[C@@H](CCCCN)C(=O)N[C@@H](CC(N)=O)C(=O)N[C@@H](CCCCN)C(N)=O
InChI Key InChIKey=NGCSEUDQOQFARY-SYEVHVEZSA-N
Data  4 KI
  Tab Delimited (TSV)   2D SDfile   Computed 3D by Vconf -m prep SDfile
Find this compound or compounds like it in BindingDB:
Activity Spreadsheet -- Enzyme Inhibition Constant Data from BindingDB
Found 4 hits for monomerid = 81531
LigandPNGBDBM81531([D-Phe2]PACAP-38 | [DPhe2]PACAP(1-38))
In DepthDetails PubMed
LigandPNGBDBM81531([D-Phe2]PACAP-38 | [DPhe2]PACAP(1-38))
In DepthDetails ArticlePubMed
TargetPituitary adenylate cyclase-activating polypeptide(Homo sapiens (Human))
UniversitÉ
Curated by PDSP Ki Database
LigandPNGBDBM81531([D-Phe2]PACAP-38 | [DPhe2]PACAP(1-38))
Affinity DataKi:  10nM
In DepthDetails ArticlePubMed
LigandPNGBDBM81531([D-Phe2]PACAP-38 | [DPhe2]PACAP(1-38))
Affinity DataKi:  40nM
In DepthDetails PubMed