BDBM81607 Isocoumarin, 9a
SMILES NC(=N)SCCOc1oc(=O)c2cc(NC(=O)c3ccccc3)ccc2c1Cl
InChI Key InChIKey=BZRRVASFHKJCJI-UHFFFAOYSA-N
Data  1 KI
  Tab Delimited (TSV)   2D SDfile   Computed 3D by Vconf -m prep SDfile
Find this compound or compounds like it in BindingDB:
Activity Spreadsheet -- Enzyme Inhibition Constant Data from BindingDB
Found 1 hit for monomerid = 81607
TargetUrokinase-type plasminogen activator(Homo sapiens (Human))
University Of New Mexico
LigandPNGBDBM81607(Isocoumarin, 9a)
Affinity DataKi:  84nM. Assay description: Inhibition of human urokinase-type plasminogen activator (uPA).
In DepthDetails ArticlePubMed