BDBM82277 NPY2-36, human::NPY2-36, rat, human
SMILES CC[C@H](C)[C@H](NC(=O)[C@H](Cc1ccc(O)cc1)NC(=O)[C@H](Cc1c[nH]cn1)NC(=O)[C@H](CCCN=C(N)N)NC(=O)[C@H](CC(C)C)NC(=O)[C@H](C)NC(=O)[C@H](CO)NC(=O)[C@H](Cc1ccc(O)cc1)NC(=O)[C@H](Cc1ccc(O)cc1)NC(=O)[C@H](CCCN=C(N)N)NC(=O)[C@H](C)NC(=O)[C@H](CCSC)NC(=O)[C@H](CC(O)=O)NC(=O)[C@H](CCC(O)=O)NC(=O)[C@H](C)NC(=O)[C@@H]1CCCN1C(=O)[C@H](C)NC(=O)[C@H](CC(O)=O)NC(=O)[C@H](CCC(O)=O)NC(=O)CNC(=O)[C@@H]1CCCN1C(=O)[C@H](CC(N)=O)NC(=O)[C@H](CC(O)=O)NC(=O)[C@@H]1CCCN1C(=O)[C@H](CCCCN)NC(=O)[C@H](CO)NC(=O)[C@@H]1CCCN1)C(=O)N[C@@H](CC(N)=O)C(=O)N[C@@H](CC(C)C)C(=O)N[C@@H]([C@@H](C)CC)C(=O)N[C@@H]([C@@H](C)O)C(=O)N[C@@H](CCCN=C(N)N)C(=O)N[C@@H](CCC(N)=O)C(=O)N[C@@H](CCCN=C(N)N)C(=O)N[C@@H](Cc1ccc(O)cc1)C(N)=O
InChI Key InChIKey=CVSAQKMUHITLOB-ZVYVYBDNSA-N
Data  9 KI
  Tab Delimited (TSV)   2D SDfile   Computed 3D by Vconf -m prep SDfile
Find this compound or compounds like it in BindingDB:
Activity Spreadsheet -- Enzyme Inhibition Constant Data from BindingDB
Found 9 hits for monomerid = 82277
LigandPNGBDBM82277(NPY2-36, human | NPY2-36, rat, human)
Affinity DataKi:  0.650nM
In DepthDetails ArticlePubMed
TargetNeuropeptide Y receptor type 2(Homo sapiens (Human))
Bristol-Myers Squibb
Curated by PDSP Ki Database
LigandPNGBDBM82277(NPY2-36, human | NPY2-36, rat, human)
Affinity DataKi:  0.800nM
In DepthDetails ArticlePubMed
TargetNeuropeptide Y receptor type 5(Homo sapiens (Human))
Bayer
Curated by PDSP Ki Database
LigandPNGBDBM82277(NPY2-36, human | NPY2-36, rat, human)
Affinity DataKi:  1.20nM
In DepthDetails ArticlePubMed
LigandPNGBDBM82277(NPY2-36, human | NPY2-36, rat, human)
Affinity DataKi:  1.20nM
In DepthDetails ArticlePubMed
TargetNeuropeptide Y receptor type 2(Homo sapiens (Human))
Bristol-Myers Squibb
Curated by PDSP Ki Database
LigandPNGBDBM82277(NPY2-36, human | NPY2-36, rat, human)
Affinity DataKi:  1.58nM
In DepthDetails ArticlePubMed
TargetNeuropeptide Y receptor type 2(Homo sapiens (Human))
Bristol-Myers Squibb
Curated by PDSP Ki Database
LigandPNGBDBM82277(NPY2-36, human | NPY2-36, rat, human)
Affinity DataKi:  1.58nM
In DepthDetails PubMed
TargetNeuropeptide Y receptor type 1(Homo sapiens (Human))
Synaptic Pharmaceutical
Curated by PDSP Ki Database
LigandPNGBDBM82277(NPY2-36, human | NPY2-36, rat, human)
Affinity DataKi:  2.45nM
In DepthDetails ArticlePubMed
TargetNeuropeptide Y receptor type 1(Homo sapiens (Human))
Synaptic Pharmaceutical
Curated by PDSP Ki Database
LigandPNGBDBM82277(NPY2-36, human | NPY2-36, rat, human)
Affinity DataKi:  2.45nM
In DepthDetails PubMed
TargetNeuropeptide Y receptor type 2(Homo sapiens (Human))
Bristol-Myers Squibb
Curated by PDSP Ki Database
LigandPNGBDBM82277(NPY2-36, human | NPY2-36, rat, human)
Affinity DataKi:  3.10nM
In DepthDetails ArticlePubMed