BDBM82821 (E)-3-(2-chlorophenyl)-N-(1,3-diketoisoindolin-5-yl)acrylamide::(E)-3-(2-chlorophenyl)-N-(1,3-dioxo-5-isoindolyl)-2-propenamide::(E)-3-(2-chlorophenyl)-N-(1,3-dioxoisoindol-5-yl)prop-2-enamide::(E)-N-[1,3-bis(oxidanylidene)isoindol-5-yl]-3-(2-chlorophenyl)prop-2-enamide::MLS000419390::SMR000320161::cid_5864175
SMILES Clc1ccccc1\C=C\C(=O)Nc1ccc2C(=O)NC(=O)c2c1
InChI Key InChIKey=JENMTPUZLVWREN-VMPITWQZSA-N
Data  6 IC50
  Tab Delimited (TSV)   2D SDfile   Computed 3D by Vconf -m prep SDfile
Find this compound or compounds like it in BindingDB:
Activity Spreadsheet -- Enzyme Inhibition Constant Data from BindingDB
Found 6 hits for monomerid = 82821
TargetCarboxy-terminal domain RNA polymerase II polypeptide A small phosphatase 1(Homo sapiens (Human))
Burnham Center For Chemical Genomics
Curated by PubChem BioAssay
LigandPNGBDBM82821((E)-3-(2-chlorophenyl)-N-(1,3-diketoisoindolin-5-y...)
Affinity DataIC50:  3.73E+3nM. Assay description: Data Source: Sanford-Burnham Center for Chemical Genomics (SBCCG) Source Affiliation: Sanford-Burnham Medical Research Institute (SBMRI, San Diego, C...
Ligand InfoPC cidPC sid
In DepthDetails PCBioAssay
TargetProthrombin(Bos taurus (Bovine))
Burnham Center For Chemical Genomics
Curated by PubChem BioAssay
LigandPNGBDBM82821((E)-3-(2-chlorophenyl)-N-(1,3-diketoisoindolin-5-y...)
Affinity DataIC50:  6.16E+4nM. Assay description: Data Source: Sanford-Burnham Center for Chemical Genomics (SBCCG) Source Affiliation: Sanford Burnham Medical Research Institute (SBMRI, La Jolla, CA...
Ligand InfoPC cidPC sid
In DepthDetails PCBioAssay
TargetTyrosine-protein phosphatase non-receptor type 22(Homo sapiens (Human))
Burnham Center For Chemical Genomics
Curated by PubChem BioAssay
LigandPNGBDBM82821((E)-3-(2-chlorophenyl)-N-(1,3-diketoisoindolin-5-y...)
Affinity DataIC50:  2.90E+4nM
Ligand InfoPC cidPC sid
In DepthDetails PCBioAssay
TargetLow molecular weight phosphotyrosine protein phosphatase(Homo sapiens (Human))
Burnham Center For Chemical Genomics
Curated by PubChem BioAssay
LigandPNGBDBM82821((E)-3-(2-chlorophenyl)-N-(1,3-diketoisoindolin-5-y...)
Affinity DataIC50:  1.58E+4nM
Ligand InfoPC cidPC sid
In DepthDetails PCBioAssay
TargetLow molecular weight phosphotyrosine protein phosphatase(Homo sapiens (Human))
Burnham Center For Chemical Genomics
Curated by PubChem BioAssay
LigandPNGBDBM82821((E)-3-(2-chlorophenyl)-N-(1,3-diketoisoindolin-5-y...)
Affinity DataIC50:  1.20E+4nM
Ligand InfoPC cidPC sid
In DepthDetails PCBioAssay
Target26S proteasome non-ATPase regulatory subunit 14(Homo sapiens (Human))
Burnham Center For Chemical Genomics
Curated by PubChem BioAssay
LigandPNGBDBM82821((E)-3-(2-chlorophenyl)-N-(1,3-diketoisoindolin-5-y...)
Affinity DataIC50:  1.79E+4nM. Assay description: Data Source: Sanford-Burnham Center for Chemical Genomics (SBCCG) Source Affiliation: Sanford Burnham Medical Research Institute (SBMRI, La Jolla, CA...
Ligand InfoPC cidPC sid
In DepthDetails PCBioAssay